{"text_format":"1","workbook":"xlsx","n_sheets":4,"sheets":["Notice","Déclar.","Tab_seul","Tab_page"],"not_rendered":{"charts":0,"images":1,"macros":1,"external_links":0,"defined_names":1,"comments":0,"pivot_tables":0},"unopened":[],"bounds":{"document_bytes":16777216,"sheet_cells":100000,"rows_first":2000,"rows_last":500,"rows_between":2000,"halvings":0,"cell_chars":16384,"cell_head_chars":4096},"cells_cut":0,"cells_raw":0,"read":"whole","date_system":"1900"}

{"sheet":"Notice","index":0,"n_rows":0,"n_cols":0,"rows_kept":0,"cut":false,"hidden":false,"merged":[]}

{"sheet":"Déclar.","index":1,"n_rows":6,"n_cols":6,"rows_kept":6,"cut":false,"hidden":false,"merged":[[1,1,5,4]]}
["graphèmes voyelles  ð\n__________________\ngraphèmes consonnes\nò","i","e","u","a","o"]
["p","Tableau limité à 11 graphèmes voyelles (colonne M) et 22 graphèmes consonnes (ligne 23)"]
["m"]
["n"]
["t"]
["h"]

{"sheet":"Tab_seul","index":2,"n_rows":24,"n_cols":11,"rows_kept":24,"cut":false,"hidden":false,"merged":[]}
[{"$f":"IF(AND(OFFSET(Déclar.!$A$1,ROW(),0)<>\"\",OFFSET(Déclar.!$A$1,0,COLUMN())<>\"\"),CONCATENATE(OFFSET(Déclar.!$A$1,ROW(),0),OFFSET(Déclar.!$A$1,0,COLUMN())),\"\")","v":"pi"},{"$f":"IF(AND(OFFSET(Déclar.!$A$1,ROW(),0)<>\"\",OFFSET(Déclar.!$A$1,0,COLUMN())<>\"\"),CONCATENATE(OFFSET(Déclar.!$A$1,ROW(),0),OFFSET(Déclar.!$A$1,0,COLUMN())),\"\")","v":"pe"},{"$f":"IF(AND(OFFSET(Déclar.!$A$1,ROW(),0)<>\"\",OFFSET(Déclar.!$A$1,0,COLUMN())<>\"\"),CONCATENATE(OFFSET(Déclar.!$A$1,ROW(),0),OFFSET(Déclar.!$A$1,0,COLUMN())),\"\")","v":"pu"},{"$f":"IF(AND(OFFSET(Déclar.!$A$1,ROW(),0)<>\"\",OFFSET(Déclar.!$A$1,0,COLUMN())<>\"\"),CONCATENATE(OFFSET(Déclar.!$A$1,ROW(),0),OFFSET(Déclar.!$A$1,0,COLUMN())),\"\")","v":"pa"},{"$f":"IF(AND(OFFSET(Déclar.!$A$1,ROW(),0)<>\"\",OFFSET(Déclar.!$A$1,0,COLUMN())<>\"\"),CONCATENATE(OFFSET(Déclar.!$A$1,ROW(),0),OFFSET(Déclar.!$A$1,0,COLUMN())),\"\")","v":"po"},{"$f":"IF(AND(OFFSET(Déclar.!$A$1,ROW(),0)<>\"\",OFFSET(Déclar.!$A$1,0,COLUMN())<>\"\"),CONCATENATE(OFFSET(Déclar.!$A$1,ROW(),0),OFFSET(Déclar.!$A$1,0,COLUMN())),\"\")","v":""},{"$f":"IF(AND(OFFSET(Déclar.!$A$1,ROW(),0)<>\"\",OFFSET(Déclar.!$A$1,0,COLUMN())<>\"\"),CONCATENATE(OFFSET(Déclar.!$A$1,ROW(),0),OFFSET(Déclar.!$A$1,0,COLUMN())),\"\")","v":""},{"$f":"IF(AND(OFFSET(Déclar.!$A$1,ROW(),0)<>\"\",OFFSET(Déclar.!$A$1,0,COLUMN())<>\"\"),CONCATENATE(OFFSET(Déclar.!$A$1,ROW(),0),OFFSET(Déclar.!$A$1,0,COLUMN())),\"\")","v":""},{"$f":"IF(AND(OFFSET(Déclar.!$A$1,ROW(),0)<>\"\",OFFSET(Déclar.!$A$1,0,COLUMN())<>\"\"),CONCATENATE(OFFSET(Déclar.!$A$1,ROW(),0),OFFSET(Déclar.!$A$1,0,COLUMN())),\"\")","v":""},{"$f":"IF(AND(OFFSET(Déclar.!$A$1,ROW(),0)<>\"\",OFFSET(Déclar.!$A$1,0,COLUMN())<>\"\"),CONCATENATE(OFFSET(Déclar.!$A$1,ROW(),0),OFFSET(Déclar.!$A$1,0,COLUMN())),\"\")","v":""},{"$f":"IF(AND(OFFSET(Déclar.!$A$1,ROW(),0)<>\"\",OFFSET(Déclar.!$A$1,0,COLUMN())<>\"\"),CONCATENATE(OFFSET(Déclar.!$A$1,ROW(),0),OFFSET(Déclar.!$A$1,0,COLUMN())),\"\")","v":""}]
[{"$f":"IF(AND(OFFSET(Déclar.!$A$1,ROW(),0)<>\"\",OFFSET(Déclar.!$A$1,0,COLUMN())<>\"\"),CONCATENATE(OFFSET(Déclar.!$A$1,ROW(),0),OFFSET(Déclar.!$A$1,0,COLUMN())),\"\")","v":"mi"},{"$f":"IF(AND(OFFSET(Déclar.!$A$1,ROW(),0)<>\"\",OFFSET(Déclar.!$A$1,0,COLUMN())<>\"\"),CONCATENATE(OFFSET(Déclar.!$A$1,ROW(),0),OFFSET(Déclar.!$A$1,0,COLUMN())),\"\")","v":"me"},{"$f":"IF(AND(OFFSET(Déclar.!$A$1,ROW(),0)<>\"\",OFFSET(Déclar.!$A$1,0,COLUMN())<>\"\"),CONCATENATE(OFFSET(Déclar.!$A$1,ROW(),0),OFFSET(Déclar.!$A$1,0,COLUMN())),\"\")","v":"mu"},{"$f":"IF(AND(OFFSET(Déclar.!$A$1,ROW(),0)<>\"\",OFFSET(Déclar.!$A$1,0,COLUMN())<>\"\"),CONCATENATE(OFFSET(Déclar.!$A$1,ROW(),0),OFFSET(Déclar.!$A$1,0,COLUMN())),\"\")","v":"ma"},{"$f":"IF(AND(OFFSET(Déclar.!$A$1,ROW(),0)<>\"\",OFFSET(Déclar.!$A$1,0,COLUMN())<>\"\"),CONCATENATE(OFFSET(Déclar.!$A$1,ROW(),0),OFFSET(Déclar.!$A$1,0,COLUMN())),\"\")","v":"mo"},{"$f":"IF(AND(OFFSET(Déclar.!$A$1,ROW(),0)<>\"\",OFFSET(Déclar.!$A$1,0,COLUMN())<>\"\"),CONCATENATE(OFFSET(Déclar.!$A$1,ROW(),0),OFFSET(Déclar.!$A$1,0,COLUMN())),\"\")","v":""},{"$f":"IF(AND(OFFSET(Déclar.!$A$1,ROW(),0)<>\"\",OFFSET(Déclar.!$A$1,0,COLUMN())<>\"\"),CONCATENATE(OFFSET(Déclar.!$A$1,ROW(),0),OFFSET(Déclar.!$A$1,0,COLUMN())),\"\")","v":""},{"$f":"IF(AND(OFFSET(Déclar.!$A$1,ROW(),0)<>\"\",OFFSET(Déclar.!$A$1,0,COLUMN())<>\"\"),CONCATENATE(OFFSET(Déclar.!$A$1,ROW(),0),OFFSET(Déclar.!$A$1,0,COLUMN())),\"\")","v":""},{"$f":"IF(AND(OFFSET(Déclar.!$A$1,ROW(),0)<>\"\",OFFSET(Déclar.!$A$1,0,COLUMN())<>\"\"),CONCATENATE(OFFSET(Déclar.!$A$1,ROW(),0),OFFSET(Déclar.!$A$1,0,COLUMN())),\"\")","v":""},{"$f":"IF(AND(OFFSET(Déclar.!$A$1,ROW(),0)<>\"\",OFFSET(Déclar.!$A$1,0,COLUMN())<>\"\"),CONCATENATE(OFFSET(Déclar.!$A$1,ROW(),0),OFFSET(Déclar.!$A$1,0,COLUMN())),\"\")","v":""},{"$f":"IF(AND(OFFSET(Déclar.!$A$1,ROW(),0)<>\"\",OFFSET(Déclar.!$A$1,0,COLUMN())<>\"\"),CONCATENATE(OFFSET(Déclar.!$A$1,ROW(),0),OFFSET(Déclar.!$A$1,0,COLUMN())),\"\")","v":""}]
[{"$f":"IF(AND(OFFSET(Déclar.!$A$1,ROW(),0)<>\"\",OFFSET(Déclar.!$A$1,0,COLUMN())<>\"\"),CONCATENATE(OFFSET(Déclar.!$A$1,ROW(),0),OFFSET(Déclar.!$A$1,0,COLUMN())),\"\")","v":"ni"},{"$f":"IF(AND(OFFSET(Déclar.!$A$1,ROW(),0)<>\"\",OFFSET(Déclar.!$A$1,0,COLUMN())<>\"\"),CONCATENATE(OFFSET(Déclar.!$A$1,ROW(),0),OFFSET(Déclar.!$A$1,0,COLUMN())),\"\")","v":"ne"},{"$f":"IF(AND(OFFSET(Déclar.!$A$1,ROW(),0)<>\"\",OFFSET(Déclar.!$A$1,0,COLUMN())<>\"\"),CONCATENATE(OFFSET(Déclar.!$A$1,ROW(),0),OFFSET(Déclar.!$A$1,0,COLUMN())),\"\")","v":"nu"},{"$f":"IF(AND(OFFSET(Déclar.!$A$1,ROW(),0)<>\"\",OFFSET(Déclar.!$A$1,0,COLUMN())<>\"\"),CONCATENATE(OFFSET(Déclar.!$A$1,ROW(),0),OFFSET(Déclar.!$A$1,0,COLUMN())),\"\")","v":"na"},{"$f":"IF(AND(OFFSET(Déclar.!$A$1,ROW(),0)<>\"\",OFFSET(Déclar.!$A$1,0,COLUMN())<>\"\"),CONCATENATE(OFFSET(Déclar.!$A$1,ROW(),0),OFFSET(Déclar.!$A$1,0,COLUMN())),\"\")","v":"no"},{"$f":"IF(AND(OFFSET(Déclar.!$A$1,ROW(),0)<>\"\",OFFSET(Déclar.!$A$1,0,COLUMN())<>\"\"),CONCATENATE(OFFSET(Déclar.!$A$1,ROW(),0),OFFSET(Déclar.!$A$1,0,COLUMN())),\"\")","v":""},{"$f":"IF(AND(OFFSET(Déclar.!$A$1,ROW(),0)<>\"\",OFFSET(Déclar.!$A$1,0,COLUMN())<>\"\"),CONCATENATE(OFFSET(Déclar.!$A$1,ROW(),0),OFFSET(Déclar.!$A$1,0,COLUMN())),\"\")","v":""},{"$f":"IF(AND(OFFSET(Déclar.!$A$1,ROW(),0)<>\"\",OFFSET(Déclar.!$A$1,0,COLUMN())<>\"\"),CONCATENATE(OFFSET(Déclar.!$A$1,ROW(),0),OFFSET(Déclar.!$A$1,0,COLUMN())),\"\")","v":""},{"$f":"IF(AND(OFFSET(Déclar.!$A$1,ROW(),0)<>\"\",OFFSET(Déclar.!$A$1,0,COLUMN())<>\"\"),CONCATENATE(OFFSET(Déclar.!$A$1,ROW(),0),OFFSET(Déclar.!$A$1,0,COLUMN())),\"\")","v":""},{"$f":"IF(AND(OFFSET(Déclar.!$A$1,ROW(),0)<>\"\",OFFSET(Déclar.!$A$1,0,COLUMN())<>\"\"),CONCATENATE(OFFSET(Déclar.!$A$1,ROW(),0),OFFSET(Déclar.!$A$1,0,COLUMN())),\"\")","v":""},{"$f":"IF(AND(OFFSET(Déclar.!$A$1,ROW(),0)<>\"\",OFFSET(Déclar.!$A$1,0,COLUMN())<>\"\"),CONCATENATE(OFFSET(Déclar.!$A$1,ROW(),0),OFFSET(Déclar.!$A$1,0,COLUMN())),\"\")","v":""}]
[{"$f":"IF(AND(OFFSET(Déclar.!$A$1,ROW(),0)<>\"\",OFFSET(Déclar.!$A$1,0,COLUMN())<>\"\"),CONCATENATE(OFFSET(Déclar.!$A$1,ROW(),0),OFFSET(Déclar.!$A$1,0,COLUMN())),\"\")","v":"ti"},{"$f":"IF(AND(OFFSET(Déclar.!$A$1,ROW(),0)<>\"\",OFFSET(Déclar.!$A$1,0,COLUMN())<>\"\"),CONCATENATE(OFFSET(Déclar.!$A$1,ROW(),0),OFFSET(Déclar.!$A$1,0,COLUMN())),\"\")","v":"te"},{"$f":"IF(AND(OFFSET(Déclar.!$A$1,ROW(),0)<>\"\",OFFSET(Déclar.!$A$1,0,COLUMN())<>\"\"),CONCATENATE(OFFSET(Déclar.!$A$1,ROW(),0),OFFSET(Déclar.!$A$1,0,COLUMN())),\"\")","v":"tu"},{"$f":"IF(AND(OFFSET(Déclar.!$A$1,ROW(),0)<>\"\",OFFSET(Déclar.!$A$1,0,COLUMN())<>\"\"),CONCATENATE(OFFSET(Déclar.!$A$1,ROW(),0),OFFSET(Déclar.!$A$1,0,COLUMN())),\"\")","v":"ta"},{"$f":"IF(AND(OFFSET(Déclar.!$A$1,ROW(),0)<>\"\",OFFSET(Déclar.!$A$1,0,COLUMN())<>\"\"),CONCATENATE(OFFSET(Déclar.!$A$1,ROW(),0),OFFSET(Déclar.!$A$1,0,COLUMN())),\"\")","v":"to"},{"$f":"IF(AND(OFFSET(Déclar.!$A$1,ROW(),0)<>\"\",OFFSET(Déclar.!$A$1,0,COLUMN())<>\"\"),CONCATENATE(OFFSET(Déclar.!$A$1,ROW(),0),OFFSET(Déclar.!$A$1,0,COLUMN())),\"\")","v":""},{"$f":"IF(AND(OFFSET(Déclar.!$A$1,ROW(),0)<>\"\",OFFSET(Déclar.!$A$1,0,COLUMN())<>\"\"),CONCATENATE(OFFSET(Déclar.!$A$1,ROW(),0),OFFSET(Déclar.!$A$1,0,COLUMN())),\"\")","v":""},{"$f":"IF(AND(OFFSET(Déclar.!$A$1,ROW(),0)<>\"\",OFFSET(Déclar.!$A$1,0,COLUMN())<>\"\"),CONCATENATE(OFFSET(Déclar.!$A$1,ROW(),0),OFFSET(Déclar.!$A$1,0,COLUMN())),\"\")","v":""},{"$f":"IF(AND(OFFSET(Déclar.!$A$1,ROW(),0)<>\"\",OFFSET(Déclar.!$A$1,0,COLUMN())<>\"\"),CONCATENATE(OFFSET(Déclar.!$A$1,ROW(),0),OFFSET(Déclar.!$A$1,0,COLUMN())),\"\")","v":""},{"$f":"IF(AND(OFFSET(Déclar.!$A$1,ROW(),0)<>\"\",OFFSET(Déclar.!$A$1,0,COLUMN())<>\"\"),CONCATENATE(OFFSET(Déclar.!$A$1,ROW(),0),OFFSET(Déclar.!$A$1,0,COLUMN())),\"\")","v":""},{"$f":"IF(AND(OFFSET(Déclar.!$A$1,ROW(),0)<>\"\",OFFSET(Déclar.!$A$1,0,COLUMN())<>\"\"),CONCATENATE(OFFSET(Déclar.!$A$1,ROW(),0),OFFSET(Déclar.!$A$1,0,COLUMN())),\"\")","v":""}]
[{"$f":"IF(AND(OFFSET(Déclar.!$A$1,ROW(),0)<>\"\",OFFSET(Déclar.!$A$1,0,COLUMN())<>\"\"),CONCATENATE(OFFSET(Déclar.!$A$1,ROW(),0),OFFSET(Déclar.!$A$1,0,COLUMN())),\"\")","v":"hi"},{"$f":"IF(AND(OFFSET(Déclar.!$A$1,ROW(),0)<>\"\",OFFSET(Déclar.!$A$1,0,COLUMN())<>\"\"),CONCATENATE(OFFSET(Déclar.!$A$1,ROW(),0),OFFSET(Déclar.!$A$1,0,COLUMN())),\"\")","v":"he"},{"$f":"IF(AND(OFFSET(Déclar.!$A$1,ROW(),0)<>\"\",OFFSET(Déclar.!$A$1,0,COLUMN())<>\"\"),CONCATENATE(OFFSET(Déclar.!$A$1,ROW(),0),OFFSET(Déclar.!$A$1,0,COLUMN())),\"\")","v":"hu"},{"$f":"IF(AND(OFFSET(Déclar.!$A$1,ROW(),0)<>\"\",OFFSET(Déclar.!$A$1,0,COLUMN())<>\"\"),CONCATENATE(OFFSET(Déclar.!$A$1,ROW(),0),OFFSET(Déclar.!$A$1,0,COLUMN())),\"\")","v":"ha"},{"$f":"IF(AND(OFFSET(Déclar.!$A$1,ROW(),0)<>\"\",OFFSET(Déclar.!$A$1,0,COLUMN())<>\"\"),CONCATENATE(OFFSET(Déclar.!$A$1,ROW(),0),OFFSET(Déclar.!$A$1,0,COLUMN())),\"\")","v":"ho"},{"$f":"IF(AND(OFFSET(Déclar.!$A$1,ROW(),0)<>\"\",OFFSET(Déclar.!$A$1,0,COLUMN())<>\"\"),CONCATENATE(OFFSET(Déclar.!$A$1,ROW(),0),OFFSET(Déclar.!$A$1,0,COLUMN())),\"\")","v":""},{"$f":"IF(AND(OFFSET(Déclar.!$A$1,ROW(),0)<>\"\",OFFSET(Déclar.!$A$1,0,COLUMN())<>\"\"),CONCATENATE(OFFSET(Déclar.!$A$1,ROW(),0),OFFSET(Déclar.!$A$1,0,COLUMN())),\"\")","v":""},{"$f":"IF(AND(OFFSET(Déclar.!$A$1,ROW(),0)<>\"\",OFFSET(Déclar.!$A$1,0,COLUMN())<>\"\"),CONCATENATE(OFFSET(Déclar.!$A$1,ROW(),0),OFFSET(Déclar.!$A$1,0,COLUMN())),\"\")","v":""},{"$f":"IF(AND(OFFSET(Déclar.!$A$1,ROW(),0)<>\"\",OFFSET(Déclar.!$A$1,0,COLUMN())<>\"\"),CONCATENATE(OFFSET(Déclar.!$A$1,ROW(),0),OFFSET(Déclar.!$A$1,0,COLUMN())),\"\")","v":""},{"$f":"IF(AND(OFFSET(Déclar.!$A$1,ROW(),0)<>\"\",OFFSET(Déclar.!$A$1,0,COLUMN())<>\"\"),CONCATENATE(OFFSET(Déclar.!$A$1,ROW(),0),OFFSET(Déclar.!$A$1,0,COLUMN())),\"\")","v":""},{"$f":"IF(AND(OFFSET(Déclar.!$A$1,ROW(),0)<>\"\",OFFSET(Déclar.!$A$1,0,COLUMN())<>\"\"),CONCATENATE(OFFSET(Déclar.!$A$1,ROW(),0),OFFSET(Déclar.!$A$1,0,COLUMN())),\"\")","v":""}]
[{"$f":"IF(AND(OFFSET(Déclar.!$A$1,ROW(),0)<>\"\",OFFSET(Déclar.!$A$1,0,COLUMN())<>\"\"),CONCATENATE(OFFSET(Déclar.!$A$1,ROW(),0),OFFSET(Déclar.!$A$1,0,COLUMN())),\"\")","v":""},{"$f":"IF(AND(OFFSET(Déclar.!$A$1,ROW(),0)<>\"\",OFFSET(Déclar.!$A$1,0,COLUMN())<>\"\"),CONCATENATE(OFFSET(Déclar.!$A$1,ROW(),0),OFFSET(Déclar.!$A$1,0,COLUMN())),\"\")","v":""},{"$f":"IF(AND(OFFSET(Déclar.!$A$1,ROW(),0)<>\"\",OFFSET(Déclar.!$A$1,0,COLUMN())<>\"\"),CONCATENATE(OFFSET(Déclar.!$A$1,ROW(),0),OFFSET(Déclar.!$A$1,0,COLUMN())),\"\")","v":""},{"$f":"IF(AND(OFFSET(Déclar.!$A$1,ROW(),0)<>\"\",OFFSET(Déclar.!$A$1,0,COLUMN())<>\"\"),CONCATENATE(OFFSET(Déclar.!$A$1,ROW(),0),OFFSET(Déclar.!$A$1,0,COLUMN())),\"\")","v":""},{"$f":"IF(AND(OFFSET(Déclar.!$A$1,ROW(),0)<>\"\",OFFSET(Déclar.!$A$1,0,COLUMN())<>\"\"),CONCATENATE(OFFSET(Déclar.!$A$1,ROW(),0),OFFSET(Déclar.!$A$1,0,COLUMN())),\"\")","v":""},{"$f":"IF(AND(OFFSET(Déclar.!$A$1,ROW(),0)<>\"\",OFFSET(Déclar.!$A$1,0,COLUMN())<>\"\"),CONCATENATE(OFFSET(Déclar.!$A$1,ROW(),0),OFFSET(Déclar.!$A$1,0,COLUMN())),\"\")","v":""},{"$f":"IF(AND(OFFSET(Déclar.!$A$1,ROW(),0)<>\"\",OFFSET(Déclar.!$A$1,0,COLUMN())<>\"\"),CONCATENATE(OFFSET(Déclar.!$A$1,ROW(),0),OFFSET(Déclar.!$A$1,0,COLUMN())),\"\")","v":""},{"$f":"IF(AND(OFFSET(Déclar.!$A$1,ROW(),0)<>\"\",OFFSET(Déclar.!$A$1,0,COLUMN())<>\"\"),CONCATENATE(OFFSET(Déclar.!$A$1,ROW(),0),OFFSET(Déclar.!$A$1,0,COLUMN())),\"\")","v":""},{"$f":"IF(AND(OFFSET(Déclar.!$A$1,ROW(),0)<>\"\",OFFSET(Déclar.!$A$1,0,COLUMN())<>\"\"),CONCATENATE(OFFSET(Déclar.!$A$1,ROW(),0),OFFSET(Déclar.!$A$1,0,COLUMN())),\"\")","v":""},{"$f":"IF(AND(OFFSET(Déclar.!$A$1,ROW(),0)<>\"\",OFFSET(Déclar.!$A$1,0,COLUMN())<>\"\"),CONCATENATE(OFFSET(Déclar.!$A$1,ROW(),0),OFFSET(Déclar.!$A$1,0,COLUMN())),\"\")","v":""},{"$f":"IF(AND(OFFSET(Déclar.!$A$1,ROW(),0)<>\"\",OFFSET(Déclar.!$A$1,0,COLUMN())<>\"\"),CONCATENATE(OFFSET(Déclar.!$A$1,ROW(),0),OFFSET(Déclar.!$A$1,0,COLUMN())),\"\")","v":""}]
[{"$f":"IF(AND(OFFSET(Déclar.!$A$1,ROW(),0)<>\"\",OFFSET(Déclar.!$A$1,0,COLUMN())<>\"\"),CONCATENATE(OFFSET(Déclar.!$A$1,ROW(),0),OFFSET(Déclar.!$A$1,0,COLUMN())),\"\")","v":""},{"$f":"IF(AND(OFFSET(Déclar.!$A$1,ROW(),0)<>\"\",OFFSET(Déclar.!$A$1,0,COLUMN())<>\"\"),CONCATENATE(OFFSET(Déclar.!$A$1,ROW(),0),OFFSET(Déclar.!$A$1,0,COLUMN())),\"\")","v":""},{"$f":"IF(AND(OFFSET(Déclar.!$A$1,ROW(),0)<>\"\",OFFSET(Déclar.!$A$1,0,COLUMN())<>\"\"),CONCATENATE(OFFSET(Déclar.!$A$1,ROW(),0),OFFSET(Déclar.!$A$1,0,COLUMN())),\"\")","v":""},{"$f":"IF(AND(OFFSET(Déclar.!$A$1,ROW(),0)<>\"\",OFFSET(Déclar.!$A$1,0,COLUMN())<>\"\"),CONCATENATE(OFFSET(Déclar.!$A$1,ROW(),0),OFFSET(Déclar.!$A$1,0,COLUMN())),\"\")","v":""},{"$f":"IF(AND(OFFSET(Déclar.!$A$1,ROW(),0)<>\"\",OFFSET(Déclar.!$A$1,0,COLUMN())<>\"\"),CONCATENATE(OFFSET(Déclar.!$A$1,ROW(),0),OFFSET(Déclar.!$A$1,0,COLUMN())),\"\")","v":""},{"$f":"IF(AND(OFFSET(Déclar.!$A$1,ROW(),0)<>\"\",OFFSET(Déclar.!$A$1,0,COLUMN())<>\"\"),CONCATENATE(OFFSET(Déclar.!$A$1,ROW(),0),OFFSET(Déclar.!$A$1,0,COLUMN())),\"\")","v":""},{"$f":"IF(AND(OFFSET(Déclar.!$A$1,ROW(),0)<>\"\",OFFSET(Déclar.!$A$1,0,COLUMN())<>\"\"),CONCATENATE(OFFSET(Déclar.!$A$1,ROW(),0),OFFSET(Déclar.!$A$1,0,COLUMN())),\"\")","v":""},{"$f":"IF(AND(OFFSET(Déclar.!$A$1,ROW(),0)<>\"\",OFFSET(Déclar.!$A$1,0,COLUMN())<>\"\"),CONCATENATE(OFFSET(Déclar.!$A$1,ROW(),0),OFFSET(Déclar.!$A$1,0,COLUMN())),\"\")","v":""},{"$f":"IF(AND(OFFSET(Déclar.!$A$1,ROW(),0)<>\"\",OFFSET(Déclar.!$A$1,0,COLUMN())<>\"\"),CONCATENATE(OFFSET(Déclar.!$A$1,ROW(),0),OFFSET(Déclar.!$A$1,0,COLUMN())),\"\")","v":""},{"$f":"IF(AND(OFFSET(Déclar.!$A$1,ROW(),0)<>\"\",OFFSET(Déclar.!$A$1,0,COLUMN())<>\"\"),CONCATENATE(OFFSET(Déclar.!$A$1,ROW(),0),OFFSET(Déclar.!$A$1,0,COLUMN())),\"\")","v":""},{"$f":"IF(AND(OFFSET(Déclar.!$A$1,ROW(),0)<>\"\",OFFSET(Déclar.!$A$1,0,COLUMN())<>\"\"),CONCATENATE(OFFSET(Déclar.!$A$1,ROW(),0),OFFSET(Déclar.!$A$1,0,COLUMN())),\"\")","v":""}]
[{"$f":"IF(AND(OFFSET(Déclar.!$A$1,ROW(),0)<>\"\",OFFSET(Déclar.!$A$1,0,COLUMN())<>\"\"),CONCATENATE(OFFSET(Déclar.!$A$1,ROW(),0),OFFSET(Déclar.!$A$1,0,COLUMN())),\"\")","v":""},{"$f":"IF(AND(OFFSET(Déclar.!$A$1,ROW(),0)<>\"\",OFFSET(Déclar.!$A$1,0,COLUMN())<>\"\"),CONCATENATE(OFFSET(Déclar.!$A$1,ROW(),0),OFFSET(Déclar.!$A$1,0,COLUMN())),\"\")","v":""},{"$f":"IF(AND(OFFSET(Déclar.!$A$1,ROW(),0)<>\"\",OFFSET(Déclar.!$A$1,0,COLUMN())<>\"\"),CONCATENATE(OFFSET(Déclar.!$A$1,ROW(),0),OFFSET(Déclar.!$A$1,0,COLUMN())),\"\")","v":""},{"$f":"IF(AND(OFFSET(Déclar.!$A$1,ROW(),0)<>\"\",OFFSET(Déclar.!$A$1,0,COLUMN())<>\"\"),CONCATENATE(OFFSET(Déclar.!$A$1,ROW(),0),OFFSET(Déclar.!$A$1,0,COLUMN())),\"\")","v":""},{"$f":"IF(AND(OFFSET(Déclar.!$A$1,ROW(),0)<>\"\",OFFSET(Déclar.!$A$1,0,COLUMN())<>\"\"),CONCATENATE(OFFSET(Déclar.!$A$1,ROW(),0),OFFSET(Déclar.!$A$1,0,COLUMN())),\"\")","v":""},{"$f":"IF(AND(OFFSET(Déclar.!$A$1,ROW(),0)<>\"\",OFFSET(Déclar.!$A$1,0,COLUMN())<>\"\"),CONCATENATE(OFFSET(Déclar.!$A$1,ROW(),0),OFFSET(Déclar.!$A$1,0,COLUMN())),\"\")","v":""},{"$f":"IF(AND(OFFSET(Déclar.!$A$1,ROW(),0)<>\"\",OFFSET(Déclar.!$A$1,0,COLUMN())<>\"\"),CONCATENATE(OFFSET(Déclar.!$A$1,ROW(),0),OFFSET(Déclar.!$A$1,0,COLUMN())),\"\")","v":""},{"$f":"IF(AND(OFFSET(Déclar.!$A$1,ROW(),0)<>\"\",OFFSET(Déclar.!$A$1,0,COLUMN())<>\"\"),CONCATENATE(OFFSET(Déclar.!$A$1,ROW(),0),OFFSET(Déclar.!$A$1,0,COLUMN())),\"\")","v":""},{"$f":"IF(AND(OFFSET(Déclar.!$A$1,ROW(),0)<>\"\",OFFSET(Déclar.!$A$1,0,COLUMN())<>\"\"),CONCATENATE(OFFSET(Déclar.!$A$1,ROW(),0),OFFSET(Déclar.!$A$1,0,COLUMN())),\"\")","v":""},{"$f":"IF(AND(OFFSET(Déclar.!$A$1,ROW(),0)<>\"\",OFFSET(Déclar.!$A$1,0,COLUMN())<>\"\"),CONCATENATE(OFFSET(Déclar.!$A$1,ROW(),0),OFFSET(Déclar.!$A$1,0,COLUMN())),\"\")","v":""},{"$f":"IF(AND(OFFSET(Déclar.!$A$1,ROW(),0)<>\"\",OFFSET(Déclar.!$A$1,0,COLUMN())<>\"\"),CONCATENATE(OFFSET(Déclar.!$A$1,ROW(),0),OFFSET(Déclar.!$A$1,0,COLUMN())),\"\")","v":""}]
[{"$f":"IF(AND(OFFSET(Déclar.!$A$1,ROW(),0)<>\"\",OFFSET(Déclar.!$A$1,0,COLUMN())<>\"\"),CONCATENATE(OFFSET(Déclar.!$A$1,ROW(),0),OFFSET(Déclar.!$A$1,0,COLUMN())),\"\")","v":""},{"$f":"IF(AND(OFFSET(Déclar.!$A$1,ROW(),0)<>\"\",OFFSET(Déclar.!$A$1,0,COLUMN())<>\"\"),CONCATENATE(OFFSET(Déclar.!$A$1,ROW(),0),OFFSET(Déclar.!$A$1,0,COLUMN())),\"\")","v":""},{"$f":"IF(AND(OFFSET(Déclar.!$A$1,ROW(),0)<>\"\",OFFSET(Déclar.!$A$1,0,COLUMN())<>\"\"),CONCATENATE(OFFSET(Déclar.!$A$1,ROW(),0),OFFSET(Déclar.!$A$1,0,COLUMN())),\"\")","v":""},{"$f":"IF(AND(OFFSET(Déclar.!$A$1,ROW(),0)<>\"\",OFFSET(Déclar.!$A$1,0,COLUMN())<>\"\"),CONCATENATE(OFFSET(Déclar.!$A$1,ROW(),0),OFFSET(Déclar.!$A$1,0,COLUMN())),\"\")","v":""},{"$f":"IF(AND(OFFSET(Déclar.!$A$1,ROW(),0)<>\"\",OFFSET(Déclar.!$A$1,0,COLUMN())<>\"\"),CONCATENATE(OFFSET(Déclar.!$A$1,ROW(),0),OFFSET(Déclar.!$A$1,0,COLUMN())),\"\")","v":""},{"$f":"IF(AND(OFFSET(Déclar.!$A$1,ROW(),0)<>\"\",OFFSET(Déclar.!$A$1,0,COLUMN())<>\"\"),CONCATENATE(OFFSET(Déclar.!$A$1,ROW(),0),OFFSET(Déclar.!$A$1,0,COLUMN())),\"\")","v":""},{"$f":"IF(AND(OFFSET(Déclar.!$A$1,ROW(),0)<>\"\",OFFSET(Déclar.!$A$1,0,COLUMN())<>\"\"),CONCATENATE(OFFSET(Déclar.!$A$1,ROW(),0),OFFSET(Déclar.!$A$1,0,COLUMN())),\"\")","v":""},{"$f":"IF(AND(OFFSET(Déclar.!$A$1,ROW(),0)<>\"\",OFFSET(Déclar.!$A$1,0,COLUMN())<>\"\"),CONCATENATE(OFFSET(Déclar.!$A$1,ROW(),0),OFFSET(Déclar.!$A$1,0,COLUMN())),\"\")","v":""},{"$f":"IF(AND(OFFSET(Déclar.!$A$1,ROW(),0)<>\"\",OFFSET(Déclar.!$A$1,0,COLUMN())<>\"\"),CONCATENATE(OFFSET(Déclar.!$A$1,ROW(),0),OFFSET(Déclar.!$A$1,0,COLUMN())),\"\")","v":""},{"$f":"IF(AND(OFFSET(Déclar.!$A$1,ROW(),0)<>\"\",OFFSET(Déclar.!$A$1,0,COLUMN())<>\"\"),CONCATENATE(OFFSET(Déclar.!$A$1,ROW(),0),OFFSET(Déclar.!$A$1,0,COLUMN())),\"\")","v":""},{"$f":"IF(AND(OFFSET(Déclar.!$A$1,ROW(),0)<>\"\",OFFSET(Déclar.!$A$1,0,COLUMN())<>\"\"),CONCATENATE(OFFSET(Déclar.!$A$1,ROW(),0),OFFSET(Déclar.!$A$1,0,COLUMN())),\"\")","v":""}]
[{"$f":"IF(AND(OFFSET(Déclar.!$A$1,ROW(),0)<>\"\",OFFSET(Déclar.!$A$1,0,COLUMN())<>\"\"),CONCATENATE(OFFSET(Déclar.!$A$1,ROW(),0),OFFSET(Déclar.!$A$1,0,COLUMN())),\"\")","v":""},{"$f":"IF(AND(OFFSET(Déclar.!$A$1,ROW(),0)<>\"\",OFFSET(Déclar.!$A$1,0,COLUMN())<>\"\"),CONCATENATE(OFFSET(Déclar.!$A$1,ROW(),0),OFFSET(Déclar.!$A$1,0,COLUMN())),\"\")","v":""},{"$f":"IF(AND(OFFSET(Déclar.!$A$1,ROW(),0)<>\"\",OFFSET(Déclar.!$A$1,0,COLUMN())<>\"\"),CONCATENATE(OFFSET(Déclar.!$A$1,ROW(),0),OFFSET(Déclar.!$A$1,0,COLUMN())),\"\")","v":""},{"$f":"IF(AND(OFFSET(Déclar.!$A$1,ROW(),0)<>\"\",OFFSET(Déclar.!$A$1,0,COLUMN())<>\"\"),CONCATENATE(OFFSET(Déclar.!$A$1,ROW(),0),OFFSET(Déclar.!$A$1,0,COLUMN())),\"\")","v":""},{"$f":"IF(AND(OFFSET(Déclar.!$A$1,ROW(),0)<>\"\",OFFSET(Déclar.!$A$1,0,COLUMN())<>\"\"),CONCATENATE(OFFSET(Déclar.!$A$1,ROW(),0),OFFSET(Déclar.!$A$1,0,COLUMN())),\"\")","v":""},{"$f":"IF(AND(OFFSET(Déclar.!$A$1,ROW(),0)<>\"\",OFFSET(Déclar.!$A$1,0,COLUMN())<>\"\"),CONCATENATE(OFFSET(Déclar.!$A$1,ROW(),0),OFFSET(Déclar.!$A$1,0,COLUMN())),\"\")","v":""},{"$f":"IF(AND(OFFSET(Déclar.!$A$1,ROW(),0)<>\"\",OFFSET(Déclar.!$A$1,0,COLUMN())<>\"\"),CONCATENATE(OFFSET(Déclar.!$A$1,ROW(),0),OFFSET(Déclar.!$A$1,0,COLUMN())),\"\")","v":""},{"$f":"IF(AND(OFFSET(Déclar.!$A$1,ROW(),0)<>\"\",OFFSET(Déclar.!$A$1,0,COLUMN())<>\"\"),CONCATENATE(OFFSET(Déclar.!$A$1,ROW(),0),OFFSET(Déclar.!$A$1,0,COLUMN())),\"\")","v":""},{"$f":"IF(AND(OFFSET(Déclar.!$A$1,ROW(),0)<>\"\",OFFSET(Déclar.!$A$1,0,COLUMN())<>\"\"),CONCATENATE(OFFSET(Déclar.!$A$1,ROW(),0),OFFSET(Déclar.!$A$1,0,COLUMN())),\"\")","v":""},{"$f":"IF(AND(OFFSET(Déclar.!$A$1,ROW(),0)<>\"\",OFFSET(Déclar.!$A$1,0,COLUMN())<>\"\"),CONCATENATE(OFFSET(Déclar.!$A$1,ROW(),0),OFFSET(Déclar.!$A$1,0,COLUMN())),\"\")","v":""},{"$f":"IF(AND(OFFSET(Déclar.!$A$1,ROW(),0)<>\"\",OFFSET(Déclar.!$A$1,0,COLUMN())<>\"\"),CONCATENATE(OFFSET(Déclar.!$A$1,ROW(),0),OFFSET(Déclar.!$A$1,0,COLUMN())),\"\")","v":""}]
[{"$f":"IF(AND(OFFSET(Déclar.!$A$1,ROW(),0)<>\"\",OFFSET(Déclar.!$A$1,0,COLUMN())<>\"\"),CONCATENATE(OFFSET(Déclar.!$A$1,ROW(),0),OFFSET(Déclar.!$A$1,0,COLUMN())),\"\")","v":""},{"$f":"IF(AND(OFFSET(Déclar.!$A$1,ROW(),0)<>\"\",OFFSET(Déclar.!$A$1,0,COLUMN())<>\"\"),CONCATENATE(OFFSET(Déclar.!$A$1,ROW(),0),OFFSET(Déclar.!$A$1,0,COLUMN())),\"\")","v":""},{"$f":"IF(AND(OFFSET(Déclar.!$A$1,ROW(),0)<>\"\",OFFSET(Déclar.!$A$1,0,COLUMN())<>\"\"),CONCATENATE(OFFSET(Déclar.!$A$1,ROW(),0),OFFSET(Déclar.!$A$1,0,COLUMN())),\"\")","v":""},{"$f":"IF(AND(OFFSET(Déclar.!$A$1,ROW(),0)<>\"\",OFFSET(Déclar.!$A$1,0,COLUMN())<>\"\"),CONCATENATE(OFFSET(Déclar.!$A$1,ROW(),0),OFFSET(Déclar.!$A$1,0,COLUMN())),\"\")","v":""},{"$f":"IF(AND(OFFSET(Déclar.!$A$1,ROW(),0)<>\"\",OFFSET(Déclar.!$A$1,0,COLUMN())<>\"\"),CONCATENATE(OFFSET(Déclar.!$A$1,ROW(),0),OFFSET(Déclar.!$A$1,0,COLUMN())),\"\")","v":""},{"$f":"IF(AND(OFFSET(Déclar.!$A$1,ROW(),0)<>\"\",OFFSET(Déclar.!$A$1,0,COLUMN())<>\"\"),CONCATENATE(OFFSET(Déclar.!$A$1,ROW(),0),OFFSET(Déclar.!$A$1,0,COLUMN())),\"\")","v":""},{"$f":"IF(AND(OFFSET(Déclar.!$A$1,ROW(),0)<>\"\",OFFSET(Déclar.!$A$1,0,COLUMN())<>\"\"),CONCATENATE(OFFSET(Déclar.!$A$1,ROW(),0),OFFSET(Déclar.!$A$1,0,COLUMN())),\"\")","v":""},{"$f":"IF(AND(OFFSET(Déclar.!$A$1,ROW(),0)<>\"\",OFFSET(Déclar.!$A$1,0,COLUMN())<>\"\"),CONCATENATE(OFFSET(Déclar.!$A$1,ROW(),0),OFFSET(Déclar.!$A$1,0,COLUMN())),\"\")","v":""},{"$f":"IF(AND(OFFSET(Déclar.!$A$1,ROW(),0)<>\"\",OFFSET(Déclar.!$A$1,0,COLUMN())<>\"\"),CONCATENATE(OFFSET(Déclar.!$A$1,ROW(),0),OFFSET(Déclar.!$A$1,0,COLUMN())),\"\")","v":""},{"$f":"IF(AND(OFFSET(Déclar.!$A$1,ROW(),0)<>\"\",OFFSET(Déclar.!$A$1,0,COLUMN())<>\"\"),CONCATENATE(OFFSET(Déclar.!$A$1,ROW(),0),OFFSET(Déclar.!$A$1,0,COLUMN())),\"\")","v":""},{"$f":"IF(AND(OFFSET(Déclar.!$A$1,ROW(),0)<>\"\",OFFSET(Déclar.!$A$1,0,COLUMN())<>\"\"),CONCATENATE(OFFSET(Déclar.!$A$1,ROW(),0),OFFSET(Déclar.!$A$1,0,COLUMN())),\"\")","v":""}]
[{"$f":"IF(AND(OFFSET(Déclar.!$A$1,ROW(),0)<>\"\",OFFSET(Déclar.!$A$1,0,COLUMN())<>\"\"),CONCATENATE(OFFSET(Déclar.!$A$1,ROW(),0),OFFSET(Déclar.!$A$1,0,COLUMN())),\"\")","v":""},{"$f":"IF(AND(OFFSET(Déclar.!$A$1,ROW(),0)<>\"\",OFFSET(Déclar.!$A$1,0,COLUMN())<>\"\"),CONCATENATE(OFFSET(Déclar.!$A$1,ROW(),0),OFFSET(Déclar.!$A$1,0,COLUMN())),\"\")","v":""},{"$f":"IF(AND(OFFSET(Déclar.!$A$1,ROW(),0)<>\"\",OFFSET(Déclar.!$A$1,0,COLUMN())<>\"\"),CONCATENATE(OFFSET(Déclar.!$A$1,ROW(),0),OFFSET(Déclar.!$A$1,0,COLUMN())),\"\")","v":""},{"$f":"IF(AND(OFFSET(Déclar.!$A$1,ROW(),0)<>\"\",OFFSET(Déclar.!$A$1,0,COLUMN())<>\"\"),CONCATENATE(OFFSET(Déclar.!$A$1,ROW(),0),OFFSET(Déclar.!$A$1,0,COLUMN())),\"\")","v":""},{"$f":"IF(AND(OFFSET(Déclar.!$A$1,ROW(),0)<>\"\",OFFSET(Déclar.!$A$1,0,COLUMN())<>\"\"),CONCATENATE(OFFSET(Déclar.!$A$1,ROW(),0),OFFSET(Déclar.!$A$1,0,COLUMN())),\"\")","v":""},{"$f":"IF(AND(OFFSET(Déclar.!$A$1,ROW(),0)<>\"\",OFFSET(Déclar.!$A$1,0,COLUMN())<>\"\"),CONCATENATE(OFFSET(Déclar.!$A$1,ROW(),0),OFFSET(Déclar.!$A$1,0,COLUMN())),\"\")","v":""},{"$f":"IF(AND(OFFSET(Déclar.!$A$1,ROW(),0)<>\"\",OFFSET(Déclar.!$A$1,0,COLUMN())<>\"\"),CONCATENATE(OFFSET(Déclar.!$A$1,ROW(),0),OFFSET(Déclar.!$A$1,0,COLUMN())),\"\")","v":""},{"$f":"IF(AND(OFFSET(Déclar.!$A$1,ROW(),0)<>\"\",OFFSET(Déclar.!$A$1,0,COLUMN())<>\"\"),CONCATENATE(OFFSET(Déclar.!$A$1,ROW(),0),OFFSET(Déclar.!$A$1,0,COLUMN())),\"\")","v":""},{"$f":"IF(AND(OFFSET(Déclar.!$A$1,ROW(),0)<>\"\",OFFSET(Déclar.!$A$1,0,COLUMN())<>\"\"),CONCATENATE(OFFSET(Déclar.!$A$1,ROW(),0),OFFSET(Déclar.!$A$1,0,COLUMN())),\"\")","v":""},{"$f":"IF(AND(OFFSET(Déclar.!$A$1,ROW(),0)<>\"\",OFFSET(Déclar.!$A$1,0,COLUMN())<>\"\"),CONCATENATE(OFFSET(Déclar.!$A$1,ROW(),0),OFFSET(Déclar.!$A$1,0,COLUMN())),\"\")","v":""},{"$f":"IF(AND(OFFSET(Déclar.!$A$1,ROW(),0)<>\"\",OFFSET(Déclar.!$A$1,0,COLUMN())<>\"\"),CONCATENATE(OFFSET(Déclar.!$A$1,ROW(),0),OFFSET(Déclar.!$A$1,0,COLUMN())),\"\")","v":""}]
[{"$f":"IF(AND(OFFSET(Déclar.!$A$1,ROW(),0)<>\"\",OFFSET(Déclar.!$A$1,0,COLUMN())<>\"\"),CONCATENATE(OFFSET(Déclar.!$A$1,ROW(),0),OFFSET(Déclar.!$A$1,0,COLUMN())),\"\")","v":""},{"$f":"IF(AND(OFFSET(Déclar.!$A$1,ROW(),0)<>\"\",OFFSET(Déclar.!$A$1,0,COLUMN())<>\"\"),CONCATENATE(OFFSET(Déclar.!$A$1,ROW(),0),OFFSET(Déclar.!$A$1,0,COLUMN())),\"\")","v":""},{"$f":"IF(AND(OFFSET(Déclar.!$A$1,ROW(),0)<>\"\",OFFSET(Déclar.!$A$1,0,COLUMN())<>\"\"),CONCATENATE(OFFSET(Déclar.!$A$1,ROW(),0),OFFSET(Déclar.!$A$1,0,COLUMN())),\"\")","v":""},{"$f":"IF(AND(OFFSET(Déclar.!$A$1,ROW(),0)<>\"\",OFFSET(Déclar.!$A$1,0,COLUMN())<>\"\"),CONCATENATE(OFFSET(Déclar.!$A$1,ROW(),0),OFFSET(Déclar.!$A$1,0,COLUMN())),\"\")","v":""},{"$f":"IF(AND(OFFSET(Déclar.!$A$1,ROW(),0)<>\"\",OFFSET(Déclar.!$A$1,0,COLUMN())<>\"\"),CONCATENATE(OFFSET(Déclar.!$A$1,ROW(),0),OFFSET(Déclar.!$A$1,0,COLUMN())),\"\")","v":""},{"$f":"IF(AND(OFFSET(Déclar.!$A$1,ROW(),0)<>\"\",OFFSET(Déclar.!$A$1,0,COLUMN())<>\"\"),CONCATENATE(OFFSET(Déclar.!$A$1,ROW(),0),OFFSET(Déclar.!$A$1,0,COLUMN())),\"\")","v":""},{"$f":"IF(AND(OFFSET(Déclar.!$A$1,ROW(),0)<>\"\",OFFSET(Déclar.!$A$1,0,COLUMN())<>\"\"),CONCATENATE(OFFSET(Déclar.!$A$1,ROW(),0),OFFSET(Déclar.!$A$1,0,COLUMN())),\"\")","v":""},{"$f":"IF(AND(OFFSET(Déclar.!$A$1,ROW(),0)<>\"\",OFFSET(Déclar.!$A$1,0,COLUMN())<>\"\"),CONCATENATE(OFFSET(Déclar.!$A$1,ROW(),0),OFFSET(Déclar.!$A$1,0,COLUMN())),\"\")","v":""},{"$f":"IF(AND(OFFSET(Déclar.!$A$1,ROW(),0)<>\"\",OFFSET(Déclar.!$A$1,0,COLUMN())<>\"\"),CONCATENATE(OFFSET(Déclar.!$A$1,ROW(),0),OFFSET(Déclar.!$A$1,0,COLUMN())),\"\")","v":""},{"$f":"IF(AND(OFFSET(Déclar.!$A$1,ROW(),0)<>\"\",OFFSET(Déclar.!$A$1,0,COLUMN())<>\"\"),CONCATENATE(OFFSET(Déclar.!$A$1,ROW(),0),OFFSET(Déclar.!$A$1,0,COLUMN())),\"\")","v":""},{"$f":"IF(AND(OFFSET(Déclar.!$A$1,ROW(),0)<>\"\",OFFSET(Déclar.!$A$1,0,COLUMN())<>\"\"),CONCATENATE(OFFSET(Déclar.!$A$1,ROW(),0),OFFSET(Déclar.!$A$1,0,COLUMN())),\"\")","v":""}]
[{"$f":"IF(AND(OFFSET(Déclar.!$A$1,ROW(),0)<>\"\",OFFSET(Déclar.!$A$1,0,COLUMN())<>\"\"),CONCATENATE(OFFSET(Déclar.!$A$1,ROW(),0),OFFSET(Déclar.!$A$1,0,COLUMN())),\"\")","v":""},{"$f":"IF(AND(OFFSET(Déclar.!$A$1,ROW(),0)<>\"\",OFFSET(Déclar.!$A$1,0,COLUMN())<>\"\"),CONCATENATE(OFFSET(Déclar.!$A$1,ROW(),0),OFFSET(Déclar.!$A$1,0,COLUMN())),\"\")","v":""},{"$f":"IF(AND(OFFSET(Déclar.!$A$1,ROW(),0)<>\"\",OFFSET(Déclar.!$A$1,0,COLUMN())<>\"\"),CONCATENATE(OFFSET(Déclar.!$A$1,ROW(),0),OFFSET(Déclar.!$A$1,0,COLUMN())),\"\")","v":""},{"$f":"IF(AND(OFFSET(Déclar.!$A$1,ROW(),0)<>\"\",OFFSET(Déclar.!$A$1,0,COLUMN())<>\"\"),CONCATENATE(OFFSET(Déclar.!$A$1,ROW(),0),OFFSET(Déclar.!$A$1,0,COLUMN())),\"\")","v":""},{"$f":"IF(AND(OFFSET(Déclar.!$A$1,ROW(),0)<>\"\",OFFSET(Déclar.!$A$1,0,COLUMN())<>\"\"),CONCATENATE(OFFSET(Déclar.!$A$1,ROW(),0),OFFSET(Déclar.!$A$1,0,COLUMN())),\"\")","v":""},{"$f":"IF(AND(OFFSET(Déclar.!$A$1,ROW(),0)<>\"\",OFFSET(Déclar.!$A$1,0,COLUMN())<>\"\"),CONCATENATE(OFFSET(Déclar.!$A$1,ROW(),0),OFFSET(Déclar.!$A$1,0,COLUMN())),\"\")","v":""},{"$f":"IF(AND(OFFSET(Déclar.!$A$1,ROW(),0)<>\"\",OFFSET(Déclar.!$A$1,0,COLUMN())<>\"\"),CONCATENATE(OFFSET(Déclar.!$A$1,ROW(),0),OFFSET(Déclar.!$A$1,0,COLUMN())),\"\")","v":""},{"$f":"IF(AND(OFFSET(Déclar.!$A$1,ROW(),0)<>\"\",OFFSET(Déclar.!$A$1,0,COLUMN())<>\"\"),CONCATENATE(OFFSET(Déclar.!$A$1,ROW(),0),OFFSET(Déclar.!$A$1,0,COLUMN())),\"\")","v":""},{"$f":"IF(AND(OFFSET(Déclar.!$A$1,ROW(),0)<>\"\",OFFSET(Déclar.!$A$1,0,COLUMN())<>\"\"),CONCATENATE(OFFSET(Déclar.!$A$1,ROW(),0),OFFSET(Déclar.!$A$1,0,COLUMN())),\"\")","v":""},{"$f":"IF(AND(OFFSET(Déclar.!$A$1,ROW(),0)<>\"\",OFFSET(Déclar.!$A$1,0,COLUMN())<>\"\"),CONCATENATE(OFFSET(Déclar.!$A$1,ROW(),0),OFFSET(Déclar.!$A$1,0,COLUMN())),\"\")","v":""},{"$f":"IF(AND(OFFSET(Déclar.!$A$1,ROW(),0)<>\"\",OFFSET(Déclar.!$A$1,0,COLUMN())<>\"\"),CONCATENATE(OFFSET(Déclar.!$A$1,ROW(),0),OFFSET(Déclar.!$A$1,0,COLUMN())),\"\")","v":""}]
[{"$f":"IF(AND(OFFSET(Déclar.!$A$1,ROW(),0)<>\"\",OFFSET(Déclar.!$A$1,0,COLUMN())<>\"\"),CONCATENATE(OFFSET(Déclar.!$A$1,ROW(),0),OFFSET(Déclar.!$A$1,0,COLUMN())),\"\")","v":""},{"$f":"IF(AND(OFFSET(Déclar.!$A$1,ROW(),0)<>\"\",OFFSET(Déclar.!$A$1,0,COLUMN())<>\"\"),CONCATENATE(OFFSET(Déclar.!$A$1,ROW(),0),OFFSET(Déclar.!$A$1,0,COLUMN())),\"\")","v":""},{"$f":"IF(AND(OFFSET(Déclar.!$A$1,ROW(),0)<>\"\",OFFSET(Déclar.!$A$1,0,COLUMN())<>\"\"),CONCATENATE(OFFSET(Déclar.!$A$1,ROW(),0),OFFSET(Déclar.!$A$1,0,COLUMN())),\"\")","v":""},{"$f":"IF(AND(OFFSET(Déclar.!$A$1,ROW(),0)<>\"\",OFFSET(Déclar.!$A$1,0,COLUMN())<>\"\"),CONCATENATE(OFFSET(Déclar.!$A$1,ROW(),0),OFFSET(Déclar.!$A$1,0,COLUMN())),\"\")","v":""},{"$f":"IF(AND(OFFSET(Déclar.!$A$1,ROW(),0)<>\"\",OFFSET(Déclar.!$A$1,0,COLUMN())<>\"\"),CONCATENATE(OFFSET(Déclar.!$A$1,ROW(),0),OFFSET(Déclar.!$A$1,0,COLUMN())),\"\")","v":""},{"$f":"IF(AND(OFFSET(Déclar.!$A$1,ROW(),0)<>\"\",OFFSET(Déclar.!$A$1,0,COLUMN())<>\"\"),CONCATENATE(OFFSET(Déclar.!$A$1,ROW(),0),OFFSET(Déclar.!$A$1,0,COLUMN())),\"\")","v":""},{"$f":"IF(AND(OFFSET(Déclar.!$A$1,ROW(),0)<>\"\",OFFSET(Déclar.!$A$1,0,COLUMN())<>\"\"),CONCATENATE(OFFSET(Déclar.!$A$1,ROW(),0),OFFSET(Déclar.!$A$1,0,COLUMN())),\"\")","v":""},{"$f":"IF(AND(OFFSET(Déclar.!$A$1,ROW(),0)<>\"\",OFFSET(Déclar.!$A$1,0,COLUMN())<>\"\"),CONCATENATE(OFFSET(Déclar.!$A$1,ROW(),0),OFFSET(Déclar.!$A$1,0,COLUMN())),\"\")","v":""},{"$f":"IF(AND(OFFSET(Déclar.!$A$1,ROW(),0)<>\"\",OFFSET(Déclar.!$A$1,0,COLUMN())<>\"\"),CONCATENATE(OFFSET(Déclar.!$A$1,ROW(),0),OFFSET(Déclar.!$A$1,0,COLUMN())),\"\")","v":""},{"$f":"IF(AND(OFFSET(Déclar.!$A$1,ROW(),0)<>\"\",OFFSET(Déclar.!$A$1,0,COLUMN())<>\"\"),CONCATENATE(OFFSET(Déclar.!$A$1,ROW(),0),OFFSET(Déclar.!$A$1,0,COLUMN())),\"\")","v":""},{"$f":"IF(AND(OFFSET(Déclar.!$A$1,ROW(),0)<>\"\",OFFSET(Déclar.!$A$1,0,COLUMN())<>\"\"),CONCATENATE(OFFSET(Déclar.!$A$1,ROW(),0),OFFSET(Déclar.!$A$1,0,COLUMN())),\"\")","v":""}]
[{"$f":"IF(AND(OFFSET(Déclar.!$A$1,ROW(),0)<>\"\",OFFSET(Déclar.!$A$1,0,COLUMN())<>\"\"),CONCATENATE(OFFSET(Déclar.!$A$1,ROW(),0),OFFSET(Déclar.!$A$1,0,COLUMN())),\"\")","v":""},{"$f":"IF(AND(OFFSET(Déclar.!$A$1,ROW(),0)<>\"\",OFFSET(Déclar.!$A$1,0,COLUMN())<>\"\"),CONCATENATE(OFFSET(Déclar.!$A$1,ROW(),0),OFFSET(Déclar.!$A$1,0,COLUMN())),\"\")","v":""},{"$f":"IF(AND(OFFSET(Déclar.!$A$1,ROW(),0)<>\"\",OFFSET(Déclar.!$A$1,0,COLUMN())<>\"\"),CONCATENATE(OFFSET(Déclar.!$A$1,ROW(),0),OFFSET(Déclar.!$A$1,0,COLUMN())),\"\")","v":""},{"$f":"IF(AND(OFFSET(Déclar.!$A$1,ROW(),0)<>\"\",OFFSET(Déclar.!$A$1,0,COLUMN())<>\"\"),CONCATENATE(OFFSET(Déclar.!$A$1,ROW(),0),OFFSET(Déclar.!$A$1,0,COLUMN())),\"\")","v":""},{"$f":"IF(AND(OFFSET(Déclar.!$A$1,ROW(),0)<>\"\",OFFSET(Déclar.!$A$1,0,COLUMN())<>\"\"),CONCATENATE(OFFSET(Déclar.!$A$1,ROW(),0),OFFSET(Déclar.!$A$1,0,COLUMN())),\"\")","v":""},{"$f":"IF(AND(OFFSET(Déclar.!$A$1,ROW(),0)<>\"\",OFFSET(Déclar.!$A$1,0,COLUMN())<>\"\"),CONCATENATE(OFFSET(Déclar.!$A$1,ROW(),0),OFFSET(Déclar.!$A$1,0,COLUMN())),\"\")","v":""},{"$f":"IF(AND(OFFSET(Déclar.!$A$1,ROW(),0)<>\"\",OFFSET(Déclar.!$A$1,0,COLUMN())<>\"\"),CONCATENATE(OFFSET(Déclar.!$A$1,ROW(),0),OFFSET(Déclar.!$A$1,0,COLUMN())),\"\")","v":""},{"$f":"IF(AND(OFFSET(Déclar.!$A$1,ROW(),0)<>\"\",OFFSET(Déclar.!$A$1,0,COLUMN())<>\"\"),CONCATENATE(OFFSET(Déclar.!$A$1,ROW(),0),OFFSET(Déclar.!$A$1,0,COLUMN())),\"\")","v":""},{"$f":"IF(AND(OFFSET(Déclar.!$A$1,ROW(),0)<>\"\",OFFSET(Déclar.!$A$1,0,COLUMN())<>\"\"),CONCATENATE(OFFSET(Déclar.!$A$1,ROW(),0),OFFSET(Déclar.!$A$1,0,COLUMN())),\"\")","v":""},{"$f":"IF(AND(OFFSET(Déclar.!$A$1,ROW(),0)<>\"\",OFFSET(Déclar.!$A$1,0,COLUMN())<>\"\"),CONCATENATE(OFFSET(Déclar.!$A$1,ROW(),0),OFFSET(Déclar.!$A$1,0,COLUMN())),\"\")","v":""},{"$f":"IF(AND(OFFSET(Déclar.!$A$1,ROW(),0)<>\"\",OFFSET(Déclar.!$A$1,0,COLUMN())<>\"\"),CONCATENATE(OFFSET(Déclar.!$A$1,ROW(),0),OFFSET(Déclar.!$A$1,0,COLUMN())),\"\")","v":""}]
[{"$f":"IF(AND(OFFSET(Déclar.!$A$1,ROW(),0)<>\"\",OFFSET(Déclar.!$A$1,0,COLUMN())<>\"\"),CONCATENATE(OFFSET(Déclar.!$A$1,ROW(),0),OFFSET(Déclar.!$A$1,0,COLUMN())),\"\")","v":""},{"$f":"IF(AND(OFFSET(Déclar.!$A$1,ROW(),0)<>\"\",OFFSET(Déclar.!$A$1,0,COLUMN())<>\"\"),CONCATENATE(OFFSET(Déclar.!$A$1,ROW(),0),OFFSET(Déclar.!$A$1,0,COLUMN())),\"\")","v":""},{"$f":"IF(AND(OFFSET(Déclar.!$A$1,ROW(),0)<>\"\",OFFSET(Déclar.!$A$1,0,COLUMN())<>\"\"),CONCATENATE(OFFSET(Déclar.!$A$1,ROW(),0),OFFSET(Déclar.!$A$1,0,COLUMN())),\"\")","v":""},{"$f":"IF(AND(OFFSET(Déclar.!$A$1,ROW(),0)<>\"\",OFFSET(Déclar.!$A$1,0,COLUMN())<>\"\"),CONCATENATE(OFFSET(Déclar.!$A$1,ROW(),0),OFFSET(Déclar.!$A$1,0,COLUMN())),\"\")","v":""},{"$f":"IF(AND(OFFSET(Déclar.!$A$1,ROW(),0)<>\"\",OFFSET(Déclar.!$A$1,0,COLUMN())<>\"\"),CONCATENATE(OFFSET(Déclar.!$A$1,ROW(),0),OFFSET(Déclar.!$A$1,0,COLUMN())),\"\")","v":""},{"$f":"IF(AND(OFFSET(Déclar.!$A$1,ROW(),0)<>\"\",OFFSET(Déclar.!$A$1,0,COLUMN())<>\"\"),CONCATENATE(OFFSET(Déclar.!$A$1,ROW(),0),OFFSET(Déclar.!$A$1,0,COLUMN())),\"\")","v":""},{"$f":"IF(AND(OFFSET(Déclar.!$A$1,ROW(),0)<>\"\",OFFSET(Déclar.!$A$1,0,COLUMN())<>\"\"),CONCATENATE(OFFSET(Déclar.!$A$1,ROW(),0),OFFSET(Déclar.!$A$1,0,COLUMN())),\"\")","v":""},{"$f":"IF(AND(OFFSET(Déclar.!$A$1,ROW(),0)<>\"\",OFFSET(Déclar.!$A$1,0,COLUMN())<>\"\"),CONCATENATE(OFFSET(Déclar.!$A$1,ROW(),0),OFFSET(Déclar.!$A$1,0,COLUMN())),\"\")","v":""},{"$f":"IF(AND(OFFSET(Déclar.!$A$1,ROW(),0)<>\"\",OFFSET(Déclar.!$A$1,0,COLUMN())<>\"\"),CONCATENATE(OFFSET(Déclar.!$A$1,ROW(),0),OFFSET(Déclar.!$A$1,0,COLUMN())),\"\")","v":""},{"$f":"IF(AND(OFFSET(Déclar.!$A$1,ROW(),0)<>\"\",OFFSET(Déclar.!$A$1,0,COLUMN())<>\"\"),CONCATENATE(OFFSET(Déclar.!$A$1,ROW(),0),OFFSET(Déclar.!$A$1,0,COLUMN())),\"\")","v":""},{"$f":"IF(AND(OFFSET(Déclar.!$A$1,ROW(),0)<>\"\",OFFSET(Déclar.!$A$1,0,COLUMN())<>\"\"),CONCATENATE(OFFSET(Déclar.!$A$1,ROW(),0),OFFSET(Déclar.!$A$1,0,COLUMN())),\"\")","v":""}]
[{"$f":"IF(AND(OFFSET(Déclar.!$A$1,ROW(),0)<>\"\",OFFSET(Déclar.!$A$1,0,COLUMN())<>\"\"),CONCATENATE(OFFSET(Déclar.!$A$1,ROW(),0),OFFSET(Déclar.!$A$1,0,COLUMN())),\"\")","v":""},{"$f":"IF(AND(OFFSET(Déclar.!$A$1,ROW(),0)<>\"\",OFFSET(Déclar.!$A$1,0,COLUMN())<>\"\"),CONCATENATE(OFFSET(Déclar.!$A$1,ROW(),0),OFFSET(Déclar.!$A$1,0,COLUMN())),\"\")","v":""},{"$f":"IF(AND(OFFSET(Déclar.!$A$1,ROW(),0)<>\"\",OFFSET(Déclar.!$A$1,0,COLUMN())<>\"\"),CONCATENATE(OFFSET(Déclar.!$A$1,ROW(),0),OFFSET(Déclar.!$A$1,0,COLUMN())),\"\")","v":""},{"$f":"IF(AND(OFFSET(Déclar.!$A$1,ROW(),0)<>\"\",OFFSET(Déclar.!$A$1,0,COLUMN())<>\"\"),CONCATENATE(OFFSET(Déclar.!$A$1,ROW(),0),OFFSET(Déclar.!$A$1,0,COLUMN())),\"\")","v":""},{"$f":"IF(AND(OFFSET(Déclar.!$A$1,ROW(),0)<>\"\",OFFSET(Déclar.!$A$1,0,COLUMN())<>\"\"),CONCATENATE(OFFSET(Déclar.!$A$1,ROW(),0),OFFSET(Déclar.!$A$1,0,COLUMN())),\"\")","v":""},{"$f":"IF(AND(OFFSET(Déclar.!$A$1,ROW(),0)<>\"\",OFFSET(Déclar.!$A$1,0,COLUMN())<>\"\"),CONCATENATE(OFFSET(Déclar.!$A$1,ROW(),0),OFFSET(Déclar.!$A$1,0,COLUMN())),\"\")","v":""},{"$f":"IF(AND(OFFSET(Déclar.!$A$1,ROW(),0)<>\"\",OFFSET(Déclar.!$A$1,0,COLUMN())<>\"\"),CONCATENATE(OFFSET(Déclar.!$A$1,ROW(),0),OFFSET(Déclar.!$A$1,0,COLUMN())),\"\")","v":""},{"$f":"IF(AND(OFFSET(Déclar.!$A$1,ROW(),0)<>\"\",OFFSET(Déclar.!$A$1,0,COLUMN())<>\"\"),CONCATENATE(OFFSET(Déclar.!$A$1,ROW(),0),OFFSET(Déclar.!$A$1,0,COLUMN())),\"\")","v":""},{"$f":"IF(AND(OFFSET(Déclar.!$A$1,ROW(),0)<>\"\",OFFSET(Déclar.!$A$1,0,COLUMN())<>\"\"),CONCATENATE(OFFSET(Déclar.!$A$1,ROW(),0),OFFSET(Déclar.!$A$1,0,COLUMN())),\"\")","v":""},{"$f":"IF(AND(OFFSET(Déclar.!$A$1,ROW(),0)<>\"\",OFFSET(Déclar.!$A$1,0,COLUMN())<>\"\"),CONCATENATE(OFFSET(Déclar.!$A$1,ROW(),0),OFFSET(Déclar.!$A$1,0,COLUMN())),\"\")","v":""},{"$f":"IF(AND(OFFSET(Déclar.!$A$1,ROW(),0)<>\"\",OFFSET(Déclar.!$A$1,0,COLUMN())<>\"\"),CONCATENATE(OFFSET(Déclar.!$A$1,ROW(),0),OFFSET(Déclar.!$A$1,0,COLUMN())),\"\")","v":""}]
[{"$f":"IF(AND(OFFSET(Déclar.!$A$1,ROW(),0)<>\"\",OFFSET(Déclar.!$A$1,0,COLUMN())<>\"\"),CONCATENATE(OFFSET(Déclar.!$A$1,ROW(),0),OFFSET(Déclar.!$A$1,0,COLUMN())),\"\")","v":""},{"$f":"IF(AND(OFFSET(Déclar.!$A$1,ROW(),0)<>\"\",OFFSET(Déclar.!$A$1,0,COLUMN())<>\"\"),CONCATENATE(OFFSET(Déclar.!$A$1,ROW(),0),OFFSET(Déclar.!$A$1,0,COLUMN())),\"\")","v":""},{"$f":"IF(AND(OFFSET(Déclar.!$A$1,ROW(),0)<>\"\",OFFSET(Déclar.!$A$1,0,COLUMN())<>\"\"),CONCATENATE(OFFSET(Déclar.!$A$1,ROW(),0),OFFSET(Déclar.!$A$1,0,COLUMN())),\"\")","v":""},{"$f":"IF(AND(OFFSET(Déclar.!$A$1,ROW(),0)<>\"\",OFFSET(Déclar.!$A$1,0,COLUMN())<>\"\"),CONCATENATE(OFFSET(Déclar.!$A$1,ROW(),0),OFFSET(Déclar.!$A$1,0,COLUMN())),\"\")","v":""},{"$f":"IF(AND(OFFSET(Déclar.!$A$1,ROW(),0)<>\"\",OFFSET(Déclar.!$A$1,0,COLUMN())<>\"\"),CONCATENATE(OFFSET(Déclar.!$A$1,ROW(),0),OFFSET(Déclar.!$A$1,0,COLUMN())),\"\")","v":""},{"$f":"IF(AND(OFFSET(Déclar.!$A$1,ROW(),0)<>\"\",OFFSET(Déclar.!$A$1,0,COLUMN())<>\"\"),CONCATENATE(OFFSET(Déclar.!$A$1,ROW(),0),OFFSET(Déclar.!$A$1,0,COLUMN())),\"\")","v":""},{"$f":"IF(AND(OFFSET(Déclar.!$A$1,ROW(),0)<>\"\",OFFSET(Déclar.!$A$1,0,COLUMN())<>\"\"),CONCATENATE(OFFSET(Déclar.!$A$1,ROW(),0),OFFSET(Déclar.!$A$1,0,COLUMN())),\"\")","v":""},{"$f":"IF(AND(OFFSET(Déclar.!$A$1,ROW(),0)<>\"\",OFFSET(Déclar.!$A$1,0,COLUMN())<>\"\"),CONCATENATE(OFFSET(Déclar.!$A$1,ROW(),0),OFFSET(Déclar.!$A$1,0,COLUMN())),\"\")","v":""},{"$f":"IF(AND(OFFSET(Déclar.!$A$1,ROW(),0)<>\"\",OFFSET(Déclar.!$A$1,0,COLUMN())<>\"\"),CONCATENATE(OFFSET(Déclar.!$A$1,ROW(),0),OFFSET(Déclar.!$A$1,0,COLUMN())),\"\")","v":""},{"$f":"IF(AND(OFFSET(Déclar.!$A$1,ROW(),0)<>\"\",OFFSET(Déclar.!$A$1,0,COLUMN())<>\"\"),CONCATENATE(OFFSET(Déclar.!$A$1,ROW(),0),OFFSET(Déclar.!$A$1,0,COLUMN())),\"\")","v":""},{"$f":"IF(AND(OFFSET(Déclar.!$A$1,ROW(),0)<>\"\",OFFSET(Déclar.!$A$1,0,COLUMN())<>\"\"),CONCATENATE(OFFSET(Déclar.!$A$1,ROW(),0),OFFSET(Déclar.!$A$1,0,COLUMN())),\"\")","v":""}]
[{"$f":"IF(AND(OFFSET(Déclar.!$A$1,ROW(),0)<>\"\",OFFSET(Déclar.!$A$1,0,COLUMN())<>\"\"),CONCATENATE(OFFSET(Déclar.!$A$1,ROW(),0),OFFSET(Déclar.!$A$1,0,COLUMN())),\"\")","v":""},{"$f":"IF(AND(OFFSET(Déclar.!$A$1,ROW(),0)<>\"\",OFFSET(Déclar.!$A$1,0,COLUMN())<>\"\"),CONCATENATE(OFFSET(Déclar.!$A$1,ROW(),0),OFFSET(Déclar.!$A$1,0,COLUMN())),\"\")","v":""},{"$f":"IF(AND(OFFSET(Déclar.!$A$1,ROW(),0)<>\"\",OFFSET(Déclar.!$A$1,0,COLUMN())<>\"\"),CONCATENATE(OFFSET(Déclar.!$A$1,ROW(),0),OFFSET(Déclar.!$A$1,0,COLUMN())),\"\")","v":""},{"$f":"IF(AND(OFFSET(Déclar.!$A$1,ROW(),0)<>\"\",OFFSET(Déclar.!$A$1,0,COLUMN())<>\"\"),CONCATENATE(OFFSET(Déclar.!$A$1,ROW(),0),OFFSET(Déclar.!$A$1,0,COLUMN())),\"\")","v":""},{"$f":"IF(AND(OFFSET(Déclar.!$A$1,ROW(),0)<>\"\",OFFSET(Déclar.!$A$1,0,COLUMN())<>\"\"),CONCATENATE(OFFSET(Déclar.!$A$1,ROW(),0),OFFSET(Déclar.!$A$1,0,COLUMN())),\"\")","v":""},{"$f":"IF(AND(OFFSET(Déclar.!$A$1,ROW(),0)<>\"\",OFFSET(Déclar.!$A$1,0,COLUMN())<>\"\"),CONCATENATE(OFFSET(Déclar.!$A$1,ROW(),0),OFFSET(Déclar.!$A$1,0,COLUMN())),\"\")","v":""},{"$f":"IF(AND(OFFSET(Déclar.!$A$1,ROW(),0)<>\"\",OFFSET(Déclar.!$A$1,0,COLUMN())<>\"\"),CONCATENATE(OFFSET(Déclar.!$A$1,ROW(),0),OFFSET(Déclar.!$A$1,0,COLUMN())),\"\")","v":""},{"$f":"IF(AND(OFFSET(Déclar.!$A$1,ROW(),0)<>\"\",OFFSET(Déclar.!$A$1,0,COLUMN())<>\"\"),CONCATENATE(OFFSET(Déclar.!$A$1,ROW(),0),OFFSET(Déclar.!$A$1,0,COLUMN())),\"\")","v":""},{"$f":"IF(AND(OFFSET(Déclar.!$A$1,ROW(),0)<>\"\",OFFSET(Déclar.!$A$1,0,COLUMN())<>\"\"),CONCATENATE(OFFSET(Déclar.!$A$1,ROW(),0),OFFSET(Déclar.!$A$1,0,COLUMN())),\"\")","v":""},{"$f":"IF(AND(OFFSET(Déclar.!$A$1,ROW(),0)<>\"\",OFFSET(Déclar.!$A$1,0,COLUMN())<>\"\"),CONCATENATE(OFFSET(Déclar.!$A$1,ROW(),0),OFFSET(Déclar.!$A$1,0,COLUMN())),\"\")","v":""},{"$f":"IF(AND(OFFSET(Déclar.!$A$1,ROW(),0)<>\"\",OFFSET(Déclar.!$A$1,0,COLUMN())<>\"\"),CONCATENATE(OFFSET(Déclar.!$A$1,ROW(),0),OFFSET(Déclar.!$A$1,0,COLUMN())),\"\")","v":""}]
[{"$f":"IF(AND(OFFSET(Déclar.!$A$1,ROW(),0)<>\"\",OFFSET(Déclar.!$A$1,0,COLUMN())<>\"\"),CONCATENATE(OFFSET(Déclar.!$A$1,ROW(),0),OFFSET(Déclar.!$A$1,0,COLUMN())),\"\")","v":""},{"$f":"IF(AND(OFFSET(Déclar.!$A$1,ROW(),0)<>\"\",OFFSET(Déclar.!$A$1,0,COLUMN())<>\"\"),CONCATENATE(OFFSET(Déclar.!$A$1,ROW(),0),OFFSET(Déclar.!$A$1,0,COLUMN())),\"\")","v":""},{"$f":"IF(AND(OFFSET(Déclar.!$A$1,ROW(),0)<>\"\",OFFSET(Déclar.!$A$1,0,COLUMN())<>\"\"),CONCATENATE(OFFSET(Déclar.!$A$1,ROW(),0),OFFSET(Déclar.!$A$1,0,COLUMN())),\"\")","v":""},{"$f":"IF(AND(OFFSET(Déclar.!$A$1,ROW(),0)<>\"\",OFFSET(Déclar.!$A$1,0,COLUMN())<>\"\"),CONCATENATE(OFFSET(Déclar.!$A$1,ROW(),0),OFFSET(Déclar.!$A$1,0,COLUMN())),\"\")","v":""},{"$f":"IF(AND(OFFSET(Déclar.!$A$1,ROW(),0)<>\"\",OFFSET(Déclar.!$A$1,0,COLUMN())<>\"\"),CONCATENATE(OFFSET(Déclar.!$A$1,ROW(),0),OFFSET(Déclar.!$A$1,0,COLUMN())),\"\")","v":""},{"$f":"IF(AND(OFFSET(Déclar.!$A$1,ROW(),0)<>\"\",OFFSET(Déclar.!$A$1,0,COLUMN())<>\"\"),CONCATENATE(OFFSET(Déclar.!$A$1,ROW(),0),OFFSET(Déclar.!$A$1,0,COLUMN())),\"\")","v":""},{"$f":"IF(AND(OFFSET(Déclar.!$A$1,ROW(),0)<>\"\",OFFSET(Déclar.!$A$1,0,COLUMN())<>\"\"),CONCATENATE(OFFSET(Déclar.!$A$1,ROW(),0),OFFSET(Déclar.!$A$1,0,COLUMN())),\"\")","v":""},{"$f":"IF(AND(OFFSET(Déclar.!$A$1,ROW(),0)<>\"\",OFFSET(Déclar.!$A$1,0,COLUMN())<>\"\"),CONCATENATE(OFFSET(Déclar.!$A$1,ROW(),0),OFFSET(Déclar.!$A$1,0,COLUMN())),\"\")","v":""},{"$f":"IF(AND(OFFSET(Déclar.!$A$1,ROW(),0)<>\"\",OFFSET(Déclar.!$A$1,0,COLUMN())<>\"\"),CONCATENATE(OFFSET(Déclar.!$A$1,ROW(),0),OFFSET(Déclar.!$A$1,0,COLUMN())),\"\")","v":""},{"$f":"IF(AND(OFFSET(Déclar.!$A$1,ROW(),0)<>\"\",OFFSET(Déclar.!$A$1,0,COLUMN())<>\"\"),CONCATENATE(OFFSET(Déclar.!$A$1,ROW(),0),OFFSET(Déclar.!$A$1,0,COLUMN())),\"\")","v":""},{"$f":"IF(AND(OFFSET(Déclar.!$A$1,ROW(),0)<>\"\",OFFSET(Déclar.!$A$1,0,COLUMN())<>\"\"),CONCATENATE(OFFSET(Déclar.!$A$1,ROW(),0),OFFSET(Déclar.!$A$1,0,COLUMN())),\"\")","v":""}]
[{"$f":"IF(AND(OFFSET(Déclar.!$A$1,ROW(),0)<>\"\",OFFSET(Déclar.!$A$1,0,COLUMN())<>\"\"),CONCATENATE(OFFSET(Déclar.!$A$1,ROW(),0),OFFSET(Déclar.!$A$1,0,COLUMN())),\"\")","v":""},{"$f":"IF(AND(OFFSET(Déclar.!$A$1,ROW(),0)<>\"\",OFFSET(Déclar.!$A$1,0,COLUMN())<>\"\"),CONCATENATE(OFFSET(Déclar.!$A$1,ROW(),0),OFFSET(Déclar.!$A$1,0,COLUMN())),\"\")","v":""},{"$f":"IF(AND(OFFSET(Déclar.!$A$1,ROW(),0)<>\"\",OFFSET(Déclar.!$A$1,0,COLUMN())<>\"\"),CONCATENATE(OFFSET(Déclar.!$A$1,ROW(),0),OFFSET(Déclar.!$A$1,0,COLUMN())),\"\")","v":""},{"$f":"IF(AND(OFFSET(Déclar.!$A$1,ROW(),0)<>\"\",OFFSET(Déclar.!$A$1,0,COLUMN())<>\"\"),CONCATENATE(OFFSET(Déclar.!$A$1,ROW(),0),OFFSET(Déclar.!$A$1,0,COLUMN())),\"\")","v":""},{"$f":"IF(AND(OFFSET(Déclar.!$A$1,ROW(),0)<>\"\",OFFSET(Déclar.!$A$1,0,COLUMN())<>\"\"),CONCATENATE(OFFSET(Déclar.!$A$1,ROW(),0),OFFSET(Déclar.!$A$1,0,COLUMN())),\"\")","v":""},{"$f":"IF(AND(OFFSET(Déclar.!$A$1,ROW(),0)<>\"\",OFFSET(Déclar.!$A$1,0,COLUMN())<>\"\"),CONCATENATE(OFFSET(Déclar.!$A$1,ROW(),0),OFFSET(Déclar.!$A$1,0,COLUMN())),\"\")","v":""},{"$f":"IF(AND(OFFSET(Déclar.!$A$1,ROW(),0)<>\"\",OFFSET(Déclar.!$A$1,0,COLUMN())<>\"\"),CONCATENATE(OFFSET(Déclar.!$A$1,ROW(),0),OFFSET(Déclar.!$A$1,0,COLUMN())),\"\")","v":""},{"$f":"IF(AND(OFFSET(Déclar.!$A$1,ROW(),0)<>\"\",OFFSET(Déclar.!$A$1,0,COLUMN())<>\"\"),CONCATENATE(OFFSET(Déclar.!$A$1,ROW(),0),OFFSET(Déclar.!$A$1,0,COLUMN())),\"\")","v":""},{"$f":"IF(AND(OFFSET(Déclar.!$A$1,ROW(),0)<>\"\",OFFSET(Déclar.!$A$1,0,COLUMN())<>\"\"),CONCATENATE(OFFSET(Déclar.!$A$1,ROW(),0),OFFSET(Déclar.!$A$1,0,COLUMN())),\"\")","v":""},{"$f":"IF(AND(OFFSET(Déclar.!$A$1,ROW(),0)<>\"\",OFFSET(Déclar.!$A$1,0,COLUMN())<>\"\"),CONCATENATE(OFFSET(Déclar.!$A$1,ROW(),0),OFFSET(Déclar.!$A$1,0,COLUMN())),\"\")","v":""},{"$f":"IF(AND(OFFSET(Déclar.!$A$1,ROW(),0)<>\"\",OFFSET(Déclar.!$A$1,0,COLUMN())<>\"\"),CONCATENATE(OFFSET(Déclar.!$A$1,ROW(),0),OFFSET(Déclar.!$A$1,0,COLUMN())),\"\")","v":""}]
[]
[{"$f":"COUNTA(Déclar.!A2:A23)","v":5},{"$f":"COUNTA(Déclar.!B1:R1)","v":5}]

{"sheet":"Tab_page","index":3,"n_rows":6,"n_cols":6,"rows_kept":6,"cut":false,"hidden":false,"merged":[]}
[]
[null,"pi","pe","pu","pa","po"]
[null,"mi","me","mu","ma","mo"]
[null,"ni","ne","nu","na","no"]
[null,"ti","te","tu","ta","to"]
[null,"hi","he","hu","ha","ho"]